Reaction Details
TargetTyrosine-protein phosphatase non-receptor type 11
LigandBDBM53072
Substrate/Competitorn/a
Meas. Tech.ChEMBL_984736 (CHEMBL2432110)
IC50 22500±n/a nM
Citation Liu, WYu, BXu, GXu, WRLoh, MLTang, LDQu, CK Identification of cryptotanshinone as an inhibitor of oncogenic protein tyrosine phosphatase SHP2 (PTPN11). J Med Chem56:7212-21 (2013) 
 
Tyrosine-protein phosphatase non-receptor type 11
Name:Tyrosine-protein phosphatase non-receptor type 11
Type:Protein phosphatase
Mol. Mass.:68443.59
Organism:Homo sapiens (Human)
Description:Q06124
Residue:593
BDBM53072
NameBDBM53072
Synonyms:(5Z)-3-allyl-5-(3-ethyl-1,3-benzothiazol-2-ylidene)-2-thioxo-thiazolidin-4-one (5Z)-5-(3-ethyl-1,3-benzothiazol-2-ylidene)-3-prop-2-enyl-2-sulfanylidene-4-thiazolidinone MLS001210616 cid_3094418
TypeSmall organic molecule
Emp. Form.C15H14N2OS3
Mol. Mass.334.479
SMILESCCN1\C(Sc2ccccc12)=C1\SC(=S)N(CC=C)C1=O