Reaction Details
TargetAromatase
LigandBDBM23419
Substrate/Competitorn/a
Meas. Tech.ChEMBL_985778 (CHEMBL2433995)
IC50 1200±n/a nM
Citation Andreani, ALeoni, ALocatelli, AMorigi, RRambaldi, MCervellati, RGreco, EKondratyuk, TPPark, EJHuang, Kvan Breemen, RBPezzuto, JM Chemopreventive and antioxidant activity of 6-substituted imidazo[2,1-b]thiazoles. Eur J Med Chem68:412-21 (2013) 
 
Aromatase
Name:Aromatase
Type:Enzyme
Mol. Mass.:57888.92
Organism:Homo sapiens (Human)
Description:P11511
Residue:503
BDBM23419
NameBDBM23419
Synonyms:(2S)-5,7-dihydroxy-2-(4-hydroxyphenyl)-3,4-dihydro-2H-1-benzopyran-4-one Naringenin
Typeflavanone
Emp. Form.C15H12O5
Mol. Mass.272.2528
SMILESOc1ccc(cc1)[C@@H]1CC(=O)c2c(O)cc(O)cc2O1