Reaction Details
TargetHexokinase-4
LigandBDBM50441152
Substrate/Competitorn/a
Meas. Tech.ChEMBL_984799 (CHEMBL2432301)
EC50 4940±n/a nM
Citation Hinklin, RJBoyd, SAChicarelli, MJCondroski, KRDeWolf, WELee, PALee, WSingh, AThomas, LVoegtli, WCWilliams, LAicher, TD Identification of a new class of glucokinase activators through structure-based design. J Med Chem56:7669-78 (2013) 
 
Hexokinase-4
Name:Hexokinase-4
Type:Enzyme
Mol. Mass.:52175.81
Organism:Homo sapiens (Human)
Description:P35557
Residue:465
BDBM50441152
NameBDBM50441152
Synonyms:CHEMBL2430868
TypeSmall organic molecule
Emp. Form.C16H15N3OS
Mol. Mass.297.375
SMILESCc1csc(Nc2ncccc2OCc2ccccc2)n1