Reaction Details
TargetE3 ubiquitin-protein ligase XIAP
LigandBDBM50441345
Substrate/Competitorn/a
Meas. Tech.ChEMBL_984067 (CHEMBL2434425)
IC50 44±n/a nM
Citation Donnell, AFMichoud, CRupert, KCHan, XAguilar, DFrank, KBFretland, AJGao, LGoggin, BHogg, JHHong, KJanson, CAKester, RFKong, NLe, KLi, SLiang, WLombardo, LJLou, YLukacs, CMMischke, SMoliterni, JAPolonskaia, ASchutt, ADSolis, DSSpecian, ATaylor, RTWeisel, MRemiszewski, SW Benzazepinones and benzoxazepinones as antagonists of inhibitor of apoptosis proteins (IAPs) selective for the second baculovirus IAP repeat (BIR2) domain. J Med Chem56:7772-87 (2013) 
 
E3 ubiquitin-protein ligase XIAP
Name:E3 ubiquitin-protein ligase XIAP
Type:Protein
Mol. Mass.:56685.27
Organism:Homo sapiens (Human)
Description:P98170
Residue:497
BDBM50441345
NameBDBM50441345
Synonyms:CHEMBL2431762
TypeSmall organic molecule
Emp. Form.C27H30BrN3O3
Mol. Mass.524.449
SMILESCC[C@H](NC)C(=O)N[C@H]1CCc2ccccc2N(Cc2c(OC)ccc3cc(Br)ccc23)C1=O