Reaction Details
TargetOrexin/Hypocretin receptor type 1
LigandBDBM50318701
Substrate/Competitorn/a
Meas. Tech.ChEMBL_987342 (CHEMBL2438192)
Ki 1.7±n/a nM
Citation Betschart, CHintermann, SBehnke, DCotesta, SFendt, MGee, CEJacobson, LHLaue, GOfner, SChaudhari, VBadiger, SPandit, CWagner, JHoyer, D Identification of a novel series of orexin receptor antagonists with a distinct effect on sleep architecture for the treatment of insomnia. J Med Chem56:7590-607 (2013) 
 
Orexin/Hypocretin receptor type 1
Name:Orexin/Hypocretin receptor type 1
Type:PROTEIN
Mol. Mass.:46798.55
Organism:Mus musculus
Description:ChEMBL_107669
Residue:416
BDBM50318701
NameBDBM50318701
Synonyms:CHEMBL1083659 [(7R)-4-(5-Chloro-1,3-benzoxazol-2-yl)-7-methyl-1,4-diazepan-1-yl][5-methyl-2-(2H-1,2,3-triazol-2-yl)phenyl]methanone
TypeSmall organic molecule
Emp. Form.C23H23ClN6O2
Mol. Mass.450.921
SMILESC[C@@H]1CCN(CCN1C(=O)c1cc(C)ccc1-n1nccn1)c1nc2cc(Cl)ccc2o1