Reaction Details
TargetOrexin receptor type 2
LigandBDBM50441378
Substrate/Competitorn/a
Meas. Tech.ChEMBL_987348 (CHEMBL2438198)
Ki 0.851000±n/a nM
Citation Betschart, CHintermann, SBehnke, DCotesta, SFendt, MGee, CEJacobson, LHLaue, GOfner, SChaudhari, VBadiger, SPandit, CWagner, JHoyer, D Identification of a novel series of orexin receptor antagonists with a distinct effect on sleep architecture for the treatment of insomnia. J Med Chem56:7590-607 (2013) 
 
Orexin receptor type 2
Name:Orexin receptor type 2
Type:Protein
Mol. Mass.:50710.53
Organism:Homo sapiens (Human)
Description:O43614
Residue:444
BDBM50441378
NameBDBM50441378
Synonyms:CHEMBL2435410
TypeSmall organic molecule
Emp. Form.C24H29N5O
Mol. Mass.403.52
SMILESCc1cc(C)nc(n1)N1CCC2(CCCC(=O)N2Cc2cccc3[nH]ccc23)CC1