Reaction Details
TargetOrexin receptor type 2
LigandBDBM102168
Substrate/Competitorn/a
Meas. Tech.ChEMBL_987348 (CHEMBL2438198)
Ki 0.457000±n/a nM
Citation Betschart, CHintermann, SBehnke, DCotesta, SFendt, MGee, CEJacobson, LHLaue, GOfner, SChaudhari, VBadiger, SPandit, CWagner, JHoyer, D Identification of a novel series of orexin receptor antagonists with a distinct effect on sleep architecture for the treatment of insomnia. J Med Chem56:7590-607 (2013) 
 
Orexin receptor type 2
Name:Orexin receptor type 2
Type:Protein
Mol. Mass.:50710.53
Organism:Homo sapiens (Human)
Description:O43614
Residue:444
BDBM102168
NameBDBM102168
Synonyms:US8530648, 75
TypeSmall organic molecule
Emp. Form.C26H27N5O
Mol. Mass.425.5255
SMILESO=C1CCCC2(CCN(CC2)c2cnc3ccccc3n2)N1Cc1cccc2[nH]ccc12