Reaction Details
TargetHistamine H3 receptor
LigandBDBM50441639
Substrate/Competitorn/a
Meas. Tech.ChEMBL_986996 (CHEMBL2439316)
Ki 19±n/a nM
Citation Zeng, QRosenblum, SBYang, ZJiang, YMcCormick, KDAslanian, RGDuguma, LKozlowski, JAShih, NYHey, JAWest, REKorfmacher, WABerlin, MBoyce, CW Synthesis and SAR studies of benzimidazolone derivatives as histamine H3-receptor antagonists. Bioorg Med Chem Lett23:6001-3 (2013) 
 
Histamine H3 receptor
Name:Histamine H3 receptor
Type:Enzyme Catalytic Domain
Mol. Mass.:48753.61
Organism:GUINEA PIG
Description:HISTAMINE H3 HRH3 GUINEA PIG::Q9JI35
Residue:445
BDBM50441639
NameBDBM50441639
Synonyms:CHEMBL2437428
TypeSmall organic molecule
Emp. Form.C31H41FN6O2
Mol. Mass.548.6946
SMILESNc1cc(CN2CCC(CC2)C(=O)N2CCC(CC2)n2c3ccc(F)cc3n(CC3CCCCC3)c2=O)ccn1