Reaction Details
TargetHistamine H3 receptor
LigandBDBM50441650
Substrate/Competitorn/a
Meas. Tech.ChEMBL_986996 (CHEMBL2439316)
Ki 77±n/a nM
Citation Zeng, QRosenblum, SBYang, ZJiang, YMcCormick, KDAslanian, RGDuguma, LKozlowski, JAShih, NYHey, JAWest, REKorfmacher, WABerlin, MBoyce, CW Synthesis and SAR studies of benzimidazolone derivatives as histamine H3-receptor antagonists. Bioorg Med Chem Lett23:6001-3 (2013) 
 
Histamine H3 receptor
Name:Histamine H3 receptor
Type:Enzyme Catalytic Domain
Mol. Mass.:48753.61
Organism:GUINEA PIG
Description:HISTAMINE H3 HRH3 GUINEA PIG::Q9JI35
Residue:445
BDBM50441650
NameBDBM50441650
Synonyms:CHEMBL2437418
TypeSmall organic molecule
Emp. Form.C32H36Cl2N6O2
Mol. Mass.607.573
SMILESCC(c1ccc(Cl)c(Cl)c1)n1c2ccccc2n(C2CCN(CC2)C(=O)C2CCN(Cc3ccnc(N)c3)CC2)c1=O