Reaction Details
TargetHistone-lysine N-methyltransferase EHMT2
LigandBDBM50442111
Substrate/Competitorn/a
Meas. Tech.ChEMBL_992787 (CHEMBL2444214)
IC50 14±n/a nM
Citation Liu, FBarsyte-Lovejoy, DLi, FXiong, YKorboukh, VHuang, XPAllali-Hassani, AJanzen, WPRoth, BLFrye, SVArrowsmith, CHBrown, PJVedadi, MJin, J Discovery of an in vivo chemical probe of the lysine methyltransferases G9a and GLP. J Med Chem56:8931-42 (2013) 
 
Histone-lysine N-methyltransferase EHMT2
Name:Histone-lysine N-methyltransferase EHMT2
Type:Enzyme
Mol. Mass.:132339.87
Organism:Homo sapiens (Human)
Description:Q96KQ7
Residue:1210
BDBM50442111
NameBDBM50442111
Synonyms:CHEMBL2441080
TypeSmall organic molecule
Emp. Form.C28H44N6O4S
Mol. Mass.560.752
SMILESCOc1cc2c(NC3CCN(CC3)C(C)C)nc(nc2cc1OCCCN1CCCC1)N1CCS(=O)(=O)CC1