Reaction Details
TargetSqualene synthase
LigandBDBM50442119
Substrate/Competitorn/a
Meas. Tech.ChEMBL_993092 (CHEMBL2446442)
IC50 11±n/a nM
Citation Ichikawa, MOhtsuka, MOhki, HOta, MHaginoya, NItoh, MShibata, YIshigai, YTerayama, KKanda, ASugita, KUsui, H Discovery of DF-461, a Potent Squalene Synthase Inhibitor. ACS Med Chem Lett4:932-6 (2013) 
 
Squalene synthase
Name:Squalene synthase
Type:PROTEIN
Mol. Mass.:48109.41
Organism:Rattus norvegicus
Description:ChEMBL_1336736
Residue:416
BDBM50442119
NameBDBM50442119
Synonyms:CHEMBL2441086
TypeSmall organic molecule
Emp. Form.C27H28ClN5O5
Mol. Mass.537.995
SMILESCOc1cccc([C@H]2O[C@H](CCn3cc(cn3)C(O)=O)c3nnc(C(C)C)n3-c3ccc(Cl)cc23)c1OC