Reaction Details
TargetCalcium/calmodulin-dependent protein kinase kinase 2
LigandBDBM50442139
Substrate/Competitorn/a
Meas. Tech.ChEMBL_993105 (CHEMBL2446680)
IC50 200±n/a nM
Citation Alder, CMAmbler, MCampbell, AJChampigny, ACDeakin, AMHarling, JDHarris, CALongstaff, TLynn, SMaxwell, ACMooney, CJScullion, CSingh, OMSmith, IESomers, DOTame, CJWayne, GWilson, CWoolven, JM Identification of a Novel and Selective Series of Itk Inhibitors via a Template-Hopping Strategy. ACS Med Chem Lett4:948-52 (2013) 
 
Calcium/calmodulin-dependent protein kinase kinase 2
Name:Calcium/calmodulin-dependent protein kinase kinase 2
Type:Enzyme Catalytic Domain
Mol. Mass.:64746.61
Organism:Homo sapiens (Human)
Description:gi_27437015
Residue:588
BDBM50442139
NameBDBM50442139
Synonyms:CHEMBL2441273
TypeSmall organic molecule
Emp. Form.C26H29N5OS
Mol. Mass.459.606
SMILESCCc1ccc2nc(Nc3cc(Cc4ccccc4)nc(N[C@H]4CC[C@H](O)CC4)n3)sc2c1