Reaction Details
TargetCytoplasmic tyrosine-protein kinase BMX
LigandBDBM50442139
Substrate/Competitorn/a
Meas. Tech.ChEMBL_993106 (CHEMBL2446681)
IC50 158±n/a nM
Citation Alder, CMAmbler, MCampbell, AJChampigny, ACDeakin, AMHarling, JDHarris, CALongstaff, TLynn, SMaxwell, ACMooney, CJScullion, CSingh, OMSmith, IESomers, DOTame, CJWayne, GWilson, CWoolven, JM Identification of a Novel and Selective Series of Itk Inhibitors via a Template-Hopping Strategy. ACS Med Chem Lett4:948-52 (2013) 
 
Cytoplasmic tyrosine-protein kinase BMX
Name:Cytoplasmic tyrosine-protein kinase BMX
Type:Tyrosine-protein kinase
Mol. Mass.:78030.42
Organism:Homo sapiens (Human)
Description:P51813
Residue:675
BDBM50442139
NameBDBM50442139
Synonyms:CHEMBL2441273
TypeSmall organic molecule
Emp. Form.C26H29N5OS
Mol. Mass.459.606
SMILESCCc1ccc2nc(Nc3cc(Cc4ccccc4)nc(N[C@H]4CC[C@H](O)CC4)n3)sc2c1