Reaction Details
TargetAurora kinase B
LigandBDBM50442149
Substrate/Competitorn/a
Meas. Tech.ChEMBL_993110 (CHEMBL2446685)
Ki 0.501000±n/a nM
Citation Alder, CMAmbler, MCampbell, AJChampigny, ACDeakin, AMHarling, JDHarris, CALongstaff, TLynn, SMaxwell, ACMooney, CJScullion, CSingh, OMSmith, IESomers, DOTame, CJWayne, GWilson, CWoolven, JM Identification of a Novel and Selective Series of Itk Inhibitors via a Template-Hopping Strategy. ACS Med Chem Lett4:948-52 (2013) 
 
Aurora kinase B
Name:Aurora kinase B
Type:Protein
Mol. Mass.:39327.72
Organism:Homo sapiens (Human)
Description:Q96GD4
Residue:344
BDBM50442149
NameBDBM50442149
Synonyms:CHEMBL2441267
TypeSmall organic molecule
Emp. Form.C21H25N5OS
Mol. Mass.395.521
SMILESCc1cnc(Nc2cc(Cc3ccccc3)nc(N[C@H]3CC[C@H](O)CC3)n2)s1