Reaction Details
TargetAurora kinase B
LigandBDBM50442155
Substrate/Competitorn/a
Meas. Tech.ChEMBL_993110 (CHEMBL2446685)
Ki 79±n/a nM
Citation Alder, CMAmbler, MCampbell, AJChampigny, ACDeakin, AMHarling, JDHarris, CALongstaff, TLynn, SMaxwell, ACMooney, CJScullion, CSingh, OMSmith, IESomers, DOTame, CJWayne, GWilson, CWoolven, JM Identification of a Novel and Selective Series of Itk Inhibitors via a Template-Hopping Strategy. ACS Med Chem Lett4:948-52 (2013) 
 
Aurora kinase B
Name:Aurora kinase B
Type:Protein
Mol. Mass.:39327.72
Organism:Homo sapiens (Human)
Description:Q96GD4
Residue:344
BDBM50442155
NameBDBM50442155
Synonyms:CHEMBL2441281
TypeSmall organic molecule
Emp. Form.C26H24F3N5O
Mol. Mass.479.4969
SMILESO[C@H]1CC[C@@H](CC1)Nc1nc(Nc2cc3ccccc3cn2)cc(n1)C(F)(F)c1ccc(F)cc1