Reaction Details
TargetTyrosine-protein kinase ITK/TSK
LigandBDBM50442154
Substrate/Competitorn/a
Meas. Tech.ChEMBL_993112 (CHEMBL2446687)
Ki 501±n/a nM
Citation Alder, CMAmbler, MCampbell, AJChampigny, ACDeakin, AMHarling, JDHarris, CALongstaff, TLynn, SMaxwell, ACMooney, CJScullion, CSingh, OMSmith, IESomers, DOTame, CJWayne, GWilson, CWoolven, JM Identification of a Novel and Selective Series of Itk Inhibitors via a Template-Hopping Strategy. ACS Med Chem Lett4:948-52 (2013) 
 
Tyrosine-protein kinase ITK/TSK
Name:Tyrosine-protein kinase ITK/TSK
Type:Protein
Mol. Mass.:71839.20
Organism:Homo sapiens (Human)
Description:Q08881
Residue:620
BDBM50442154
NameBDBM50442154
Synonyms:CHEMBL2441282
TypeSmall organic molecule
Emp. Form.C28H25F4N5O2
Mol. Mass.539.524
SMILESO[C@H]1CC[C@@H](CC1)Nc1nc(Nc2ccc(Oc3ccc(F)cc3)cn2)cc(n1)C(F)(F)c1ccc(F)cc1