Reaction Details
TargetTyrosine-protein kinase ITK/TSK
LigandBDBM50442155
Substrate/Competitorn/a
Meas. Tech.ChEMBL_993112 (CHEMBL2446687)
Ki 6.3±n/a nM
Citation Alder, CMAmbler, MCampbell, AJChampigny, ACDeakin, AMHarling, JDHarris, CALongstaff, TLynn, SMaxwell, ACMooney, CJScullion, CSingh, OMSmith, IESomers, DOTame, CJWayne, GWilson, CWoolven, JM Identification of a Novel and Selective Series of Itk Inhibitors via a Template-Hopping Strategy. ACS Med Chem Lett4:948-52 (2013) 
 
Tyrosine-protein kinase ITK/TSK
Name:Tyrosine-protein kinase ITK/TSK
Type:Protein
Mol. Mass.:71839.20
Organism:Homo sapiens (Human)
Description:Q08881
Residue:620
BDBM50442155
NameBDBM50442155
Synonyms:CHEMBL2441281
TypeSmall organic molecule
Emp. Form.C26H24F3N5O
Mol. Mass.479.4969
SMILESO[C@H]1CC[C@@H](CC1)Nc1nc(Nc2cc3ccccc3cn2)cc(n1)C(F)(F)c1ccc(F)cc1