Reaction Details
TargetDipeptidyl peptidase 9
LigandBDBM50442187
Substrate/Competitorn/a
Meas. Tech.ChEMBL_991616 (CHEMBL2444438)
Ki 3.3±n/a nM
Citation Devasthale, PWang, YWang, WFevig, JFeng, JWang, AHarrity, TEgan, DMorgan, NCap, MFura, AKlei, HEKish, KWeigelt, CSun, LLevesque, PMoulin, FLi, YXZahler, RKirby, MSHamann, LG Optimization of activity, selectivity, and liability profiles in 5-oxopyrrolopyridine DPP4 inhibitors leading to clinical candidate (Sa)-2-(3-(aminomethyl)-4-(2,4-dichlorophenyl)-2-methyl-5-oxo-5H-pyrrolo[3,4-b]pyridin-6(7H)-yl)-N,N-dimethylacetamide (BMS-767778). J Med Chem56:7343-57 (2013) 
 
Dipeptidyl peptidase 9
Name:Dipeptidyl peptidase 9
Type:Enzyme
Mol. Mass.:98260.70
Organism:Homo sapiens (Human)
Description:Q86TI2
Residue:863
BDBM50442187
NameBDBM50442187
Synonyms:CHEMBL2441951
TypeSmall organic molecule
Emp. Form.C18H18Cl2N4O2
Mol. Mass.393.267
SMILESCNC(=O)Cn1cc2[nH]c(C)c(CN)c(-c3ccc(Cl)cc3Cl)c2c1=O