Reaction Details
TargetSialidase
LigandBDBM50442396
Substrate/Competitorn/a
Meas. Tech.ChEMBL_991336 (CHEMBL2443545)
IC50 7850±n/a nM
Citation Wang, YCurtis-Long, MJYuk, HJKim, DWTan, XFPark, KH Bacterial neuraminidase inhibitory effects of prenylated isoflavones from roots of Flemingia philippinensis. Bioorg Med Chem21:6398-404 (2013) 
 
Sialidase
Name:Sialidase
Type:PROTEIN
Mol. Mass.:42808.79
Organism:Clostridium perfringens
Description:ChEMBL_991336
Residue:382
BDBM50442396
NameBDBM50442396
Synonyms:CHEMBL2442950
TypeSmall organic molecule
Emp. Form.C25H26O6
Mol. Mass.422.4703
SMILES[#6]\[#6](-[#6])=[#6]\[#6]-c1cc(c(-[#6]\[#6]=[#6](\[#6])-[#6])c(-[#8])c1-[#8])-c1coc2cc(-[#8])cc(-[#8])c2c1=O