Reaction Details
TargetSubstance-P receptor
LigandBDBM50413891
Substrate/Competitorn/a
Meas. Tech.ChEMBL_990533 (CHEMBL2447076)
IC50 0.250000±n/a nM
Citation Di Fabio, RAlvaro, GBraggio, SCarletti, RGerrard, PAGriffante, CMarchioro, CPozzan, AMelotto, SPoffe, APiccoli, LRatti, ETranquillini, ETrower, MSpada, SCorsi, M Identification, biological characterization and pharmacophoric analysis of a new potent and selective NK1 receptor antagonist clinical candidate. Bioorg Med Chem21:6264-73 (2013) 
 
Substance-P receptor
Name:Substance-P receptor
Type:G Protein-Coupled Receptor (GPCR)
Mol. Mass.:46254.43
Organism:Homo sapiens (Human)
Description:P25103
Residue:407
BDBM50413891
NameBDBM50413891
Synonyms:VESTIPITANT
TypeSmall organic molecule
Emp. Form.C23H24F7N3O
Mol. Mass.491.445
SMILESC[C@@H](N(C)C(=O)N1CCNC[C@@H]1c1ccc(F)cc1C)c1cc(cc(c1)C(F)(F)F)C(F)(F)F