Reaction Details
TargetEnoyl-[acyl-carrier-protein] reductase [NADH]
LigandBDBM50442997
Substrate/Competitorn/a
Meas. Tech.ChEMBL_1276820 (CHEMBL3089488)
Kd 12±n/a nM
Citation Shirude, PSMadhavapeddi, PNaik, MMurugan, KShinde, VNandishaiah, RBhat, JKumar, AHameed, SHoldgate, GDavies, GMcMiken, HHegde, NAmbady, AVenkatraman, JPanda, MBandodkar, BSambandamurthy, VKRead, JA Methyl-thiazoles: a novel mode of inhibition with the potential to develop novel inhibitors targeting InhA in Mycobacterium tuberculosis. J Med Chem56:8533-42 (2013) 
 
Enoyl-[acyl-carrier-protein] reductase [NADH]
Name:Enoyl-[acyl-carrier-protein] reductase [NADH]
Type:Enzyme
Mol. Mass.:28526.00
Organism:Mycobacterium tuberculosis (strain ATCC 25618 / H37Rv)
Description:P9WGR1
Residue:269
BDBM50442997
NameBDBM50442997
Synonyms:CHEMBL3088172
TypeSmall organic molecule
Emp. Form.C18H16F2N6OS2
Mol. Mass.434.486
SMILESCc1csc(n1)[C@](C)(O)c1nnc(Nc2ccn(Cc3c(F)cccc3F)n2)s1