Reaction Details
TargetEnoyl-[acyl-carrier-protein] reductase [NADH]
LigandBDBM8726
Substrate/Competitorn/a
Meas. Tech.ChEMBL_1276826 (CHEMBL3089494)
IC50 200±n/a nM
Citation Shirude, PSMadhavapeddi, PNaik, MMurugan, KShinde, VNandishaiah, RBhat, JKumar, AHameed, SHoldgate, GDavies, GMcMiken, HHegde, NAmbady, AVenkatraman, JPanda, MBandodkar, BSambandamurthy, VKRead, JA Methyl-thiazoles: a novel mode of inhibition with the potential to develop novel inhibitors targeting InhA in Mycobacterium tuberculosis. J Med Chem56:8533-42 (2013) 
 
Enoyl-[acyl-carrier-protein] reductase [NADH]
Name:Enoyl-[acyl-carrier-protein] reductase [NADH]
Type:Enzyme
Mol. Mass.:28526.00
Organism:Mycobacterium tuberculosis (strain ATCC 25618 / H37Rv)
Description:P9WGR1
Residue:269
BDBM8726
NameBDBM8726
Synonyms:5-chloro-2-(2,4-dichlorophenoxy)phenol TCL US20230414581, Compound 35
TypeSmall organic molecule
Emp. Form.C12H7Cl3O2
Mol. Mass.289.542
SMILESOc1cc(Cl)ccc1Oc1ccc(Cl)cc1Cl