Reaction Details
TargetHistone-lysine N-methyltransferase, H3 lysine-79 specific
LigandBDBM28453
Substrate/Competitorn/a
Meas. Tech.ChEMBL_1275652 (CHEMBL3090823)
Ki 38000±n/a nM
Citation Anglin, JLSong, Y A medicinal chemistry perspective for targeting histone H3 lysine-79 methyltransferase DOT1L. J Med Chem56:8972-83 (2013) 
 
Histone-lysine N-methyltransferase, H3 lysine-79 specific
Name:Histone-lysine N-methyltransferase, H3 lysine-79 specific
Type:Protein
Mol. Mass.:184911.91
Organism:Homo sapiens (Human)
Description:Q8TEK3
Residue:1537
BDBM28453
NameBDBM28453
Synonyms:(2R,3R,4S,5R)-2-(6-amino-9H-purin-9-yl)-5-[(dimethylamino)methyl]oxolane-3,4-diol | AdoMet substrate analogue, 23b
TypeSmall organic molecule
Emp. Form.C12H18N6O3
Mol. Mass.294.3097
SMILESCN(C)C[C@H]1O[C@H]([C@H](O)[C@@H]1O)n1cnc2c(N)ncnc12