Reaction Details
TargetFarnesyl pyrophosphate synthase
LigandBDBM50443052
Substrate/Competitorn/a
Meas. Tech.ChEMBL_1275828 (CHEMBL3091236)
IC50 14±n/a nM
Citation Leung, CYPark, JDe Schutter, JWSebag, MBerghuis, AMTsantrizos, YS Thienopyrimidine bisphosphonate (ThPBP) inhibitors of the human farnesyl pyrophosphate synthase: optimization and characterization of the mode of inhibition. J Med Chem56:7939-50 (2013) 
 
Farnesyl pyrophosphate synthase
Name:Farnesyl pyrophosphate synthase
Type:Enzyme
Mol. Mass.:48272.89
Organism:Homo sapiens (Human)
Description:P14324
Residue:419
BDBM50443052
NameBDBM50443052
Synonyms:CHEMBL3087936 | US11279719, Example C-13
TypeSmall organic molecule
Emp. Form.C16H17N3O7P2S
Mol. Mass.457.335
SMILESOP(O)(=O)C(Nc1ncnc2sc(cc12)-c1ccc(OC2CC2)cc1)P(O)(O)=O