Reaction Details
TargetFarnesyl pyrophosphate synthase
LigandBDBM36510
Substrate/Competitorn/a
Meas. Tech.ChEMBL_1275828 (CHEMBL3091236)
IC50 920±n/a nM
Citation Leung, CYPark, JDe Schutter, JWSebag, MBerghuis, AMTsantrizos, YS Thienopyrimidine bisphosphonate (ThPBP) inhibitors of the human farnesyl pyrophosphate synthase: optimization and characterization of the mode of inhibition. J Med Chem56:7939-50 (2013) 
 
Farnesyl pyrophosphate synthase
Name:Farnesyl pyrophosphate synthase
Type:Enzyme
Mol. Mass.:48272.89
Organism:Homo sapiens (Human)
Description:P14324
Residue:419
BDBM36510
NameBDBM36510
Synonyms:1-(Carboxymethyl)-1H-benzo[g]indole-2-carboxylic acid, 11 | CID46398840
TypeSmall organic molecule
Emp. Form.C15H11NO4
Mol. Mass.269.2521
SMILESOC(=O)Cn1c(cc2ccc3ccccc3c12)C(O)=O