Reaction Details
TargetFarnesyl pyrophosphate synthase
LigandBDBM50443055
Substrate/Competitorn/a
Meas. Tech.ChEMBL_1275829 (CHEMBL3091237)
IC50 440±n/a nM
Citation Leung, CYPark, JDe Schutter, JWSebag, MBerghuis, AMTsantrizos, YS Thienopyrimidine bisphosphonate (ThPBP) inhibitors of the human farnesyl pyrophosphate synthase: optimization and characterization of the mode of inhibition. J Med Chem56:7939-50 (2013) 
 
Farnesyl pyrophosphate synthase
Name:Farnesyl pyrophosphate synthase
Type:Enzyme
Mol. Mass.:48272.89
Organism:Homo sapiens (Human)
Description:P14324
Residue:419
BDBM50443055
NameBDBM50443055
Synonyms:CHEMBL3087933
TypeSmall organic molecule
Emp. Form.C14H15N3O7P2S
Mol. Mass.431.297
SMILESCOc1ccc(cc1)-c1cc2c(NC(P(O)(O)=O)P(O)(O)=O)ncnc2s1