Reaction Details
TargetTyrosine-protein kinase ITK/TSK
LigandBDBM50443182
Substrate/Competitorn/a
Meas. Tech.ChEMBL_1276382 (CHEMBL3088400)
Ki 0.500000±n/a nM
Citation MacKinnon, CHLau, KBurch, JDChen, YDines, JDing, XEigenbrot, CHeifetz, AJaochico, AJohnson, AKraemer, JKruger, SKrülle, TMLiimatta, MLy, JMaghames, RMontalbetti, CAOrtwine, DFPérez-Fuertes, YShia, SStein, DBTrani, GVaidya, DGWang, XBromidge, SMWu, LCPei, Z Structure-based design and synthesis of potent benzothiazole inhibitors of interleukin-2 inducible T cell kinase (ITK). Bioorg Med Chem Lett23:6331-5 (2013) 
 
Tyrosine-protein kinase ITK/TSK
Name:Tyrosine-protein kinase ITK/TSK
Type:Protein
Mol. Mass.:71839.20
Organism:Homo sapiens (Human)
Description:Q08881
Residue:620
BDBM50443182
NameBDBM50443182
Synonyms:CHEMBL3086538
TypeSmall organic molecule
Emp. Form.C26H29N5O2S
Mol. Mass.475.606
SMILESCCN(CC)Cc1cc(ccc1OC)[C@H]1C[C@@H]1C(=O)Nc1nc2ccc(cc2s1)-c1cn[nH]c1