Reaction Details
TargetCytochrome P450 2C9
LigandBDBM50443217
Substrate/Competitorn/a
Meas. Tech.ChEMBL_1276723 (CHEMBL3089231)
IC50>100000±n/a nM
Citation Gao, ZHurst, WJCzechtizky, WHall, DMoindrot, NNagorny, RPichat, PStefany, DHendrix, JAGeorge, PG Identification and profiling of 3,5-dimethyl-isoxazole-4-carboxylic acid [2-methyl-4-((2S,3'S)-2-methyl-[1,3']bipyrrolidinyl-1'-yl)phenyl] amide as histamine H(3) receptor antagonist for the treatment of depression. Bioorg Med Chem Lett23:6269-73 (2013) 
 
Cytochrome P450 2C9
Name:Cytochrome P450 2C9
Type:Enzyme
Mol. Mass.:55636.33
Organism:Homo sapiens (Human)
Description:P11712
Residue:490
BDBM50443217
NameBDBM50443217
Synonyms:CHEMBL3087669
TypeSmall organic molecule
Emp. Form.C22H30N4O2
Mol. Mass.382.4992
SMILESC[C@H]1CCCN1[C@H]1CCN(C1)c1ccc(NC(=O)c2c(C)noc2C)c(C)c1