Reaction Details
TargetProteinase-activated receptor 1
LigandBDBM50443583
Substrate/Competitorn/a
Meas. Tech.ChEMBL_1279178 (CHEMBL3095279)
IC50 7.2±n/a nM
Citation Lee, SSong, JHPark, CMKim, JSJeong, JHCho, WYLim, DC Discovery of Octahydroindenes as PAR1 Antagonists. ACS Med Chem Lett4:1054-8 (2013) 
 
Proteinase-activated receptor 1
Name:Proteinase-activated receptor 1
Type:Protein
Mol. Mass.:47450.07
Organism:Homo sapiens (Human)
Description:P25116
Residue:425
BDBM50443583
NameBDBM50443583
Synonyms:CHEMBL3091981
TypeSmall organic molecule
Emp. Form.C24H25FN2O2
Mol. Mass.392.4659
SMILESFc1cccc(c1)-c1ccc(C=C[C@@H]2[C@H]3CCCC[C@H]3CC22CNC(=O)O2)nc1