Reaction Details
TargetProteinase-activated receptor 1
LigandBDBM50443580
Substrate/Competitorn/a
Meas. Tech.ChEMBL_1279179 (CHEMBL3095280)
IC50 2.7±n/a nM
Citation Lee, SSong, JHPark, CMKim, JSJeong, JHCho, WYLim, DC Discovery of Octahydroindenes as PAR1 Antagonists. ACS Med Chem Lett4:1054-8 (2013) 
 
Proteinase-activated receptor 1
Name:Proteinase-activated receptor 1
Type:Protein
Mol. Mass.:47450.07
Organism:Homo sapiens (Human)
Description:P25116
Residue:425
BDBM50443580
NameBDBM50443580
Synonyms:CHEMBL3091993
TypeSmall organic molecule
Emp. Form.C24H27FN2O2
Mol. Mass.394.4818
SMILESCC1(C[C@@H]2CCCC[C@@H]2[C@H]1C=Cc1ccc(cn1)-c1cccc(F)c1)OC(N)=O