Reaction Details
TargetProteinase-activated receptor 1
LigandBDBM50443594
Substrate/Competitorn/a
Meas. Tech.ChEMBL_1279179 (CHEMBL3095280)
IC50 67±n/a nM
Citation Lee, SSong, JHPark, CMKim, JSJeong, JHCho, WYLim, DC Discovery of Octahydroindenes as PAR1 Antagonists. ACS Med Chem Lett4:1054-8 (2013) 
 
Proteinase-activated receptor 1
Name:Proteinase-activated receptor 1
Type:Protein
Mol. Mass.:47450.07
Organism:Homo sapiens (Human)
Description:P25116
Residue:425
BDBM50443594
NameBDBM50443594
Synonyms:CHEMBL3091985
TypeSmall organic molecule
Emp. Form.C24H26FNO2
Mol. Mass.379.4671
SMILESCC(=O)OC1C[C@@H]2CCCC[C@@H]2[C@H]1\C=C\c1ccc(cn1)-c1cccc(F)c1