Reaction Details
TargetNuclear receptor subfamily 1 group I member 2
LigandBDBM50443607
Substrate/Competitorn/a
Meas. Tech.ChEMBL_1279400 (CHEMBL3096556)
EC50 1900±n/a nM
Citation Shao, PPYe, FChakravarty, PKHerrington, JBDai, GBugianesi, RMHaedo, RJSwensen, AMWarren, VASmith, MMGarcia, MLMcManus, OBLyons, KALi, XGreen, MJochnowitz, NMcGowan, EMistry, SSun, SYAbbadie, CKaczorowski, GJDuffy, JL Improved Cav2.2 Channel Inhibitors through a gem-Dimethylsulfone Bioisostere Replacement of a Labile Sulfonamide. ACS Med Chem Lett4:1064-8 (2013) 
 
Nuclear receptor subfamily 1 group I member 2
Name:Nuclear receptor subfamily 1 group I member 2
Type:Nuclear receptor
Mol. Mass.:49774.77
Organism:Homo sapiens (Human)
Description:O75469
Residue:434
BDBM50443607
NameBDBM50443607
Synonyms:CHEMBL3092207
TypeSmall organic molecule
Emp. Form.C24H23F6N3O4S
Mol. Mass.563.513
SMILESNC(=O)c1ccc(C(=O)N2CCC(CC2)N(C2CC2)S(=O)(=O)c2cccc(c2)C(F)(F)F)c(c1)C(F)(F)F