Reaction Details
TargetNuclear receptor subfamily 1 group I member 2
LigandBDBM50443609
Substrate/Competitorn/a
Meas. Tech.ChEMBL_1279400 (CHEMBL3096556)
EC50 2800±n/a nM
Citation Shao, PPYe, FChakravarty, PKHerrington, JBDai, GBugianesi, RMHaedo, RJSwensen, AMWarren, VASmith, MMGarcia, MLMcManus, OBLyons, KALi, XGreen, MJochnowitz, NMcGowan, EMistry, SSun, SYAbbadie, CKaczorowski, GJDuffy, JL Improved Cav2.2 Channel Inhibitors through a gem-Dimethylsulfone Bioisostere Replacement of a Labile Sulfonamide. ACS Med Chem Lett4:1064-8 (2013) 
 
Nuclear receptor subfamily 1 group I member 2
Name:Nuclear receptor subfamily 1 group I member 2
Type:Nuclear receptor
Mol. Mass.:49774.77
Organism:Homo sapiens (Human)
Description:O75469
Residue:434
BDBM50443609
NameBDBM50443609
Synonyms:CHEMBL3092205
TypeSmall organic molecule
Emp. Form.C24H24F6N2O5S2
Mol. Mass.598.578
SMILESCS(=O)(=O)c1ccc(C(=O)N2CCC(CC2)N(C2CC2)S(=O)(=O)c2cccc(c2)C(F)(F)F)c(c1)C(F)(F)F