Reaction Details
Target5-hydroxytryptamine receptor 4
LigandBDBM50443687
Substrate/Competitorn/a
Meas. Tech.ChEMBL_1278685 (CHEMBL3095863)
Ki 4.2±n/a nM
Citation Fontenelle, CQWang, ZFossey, CCailly, TLinclau, BFabis, F Design of fluorinated 5-HT(4)R antagonists: influence of the basicity and lipophilicity toward the 5-HT(4)R binding affinities. Bioorg Med Chem21:7529-38 (2013) 
 
5-hydroxytryptamine receptor 4
Name:5-hydroxytryptamine receptor 4
Type:Enzyme Catalytic Domain
Mol. Mass.:43735.29
Organism:GUINEA PIG
Description:5-HT4 HTR4 GUINEA PIG::O70528
Residue:388
BDBM50443687
NameBDBM50443687
Synonyms:CHEMBL3093187
TypeSmall organic molecule
Emp. Form.C22H23F4N3O
Mol. Mass.421.4311
SMILESFc1cccc2c1nc(OCC1CCN(CCCC(F)(F)F)CC1)c1cccnc21