Reaction Details
TargetPolyunsaturated fatty acid 5-lipoxygenase
LigandBDBM24560
Substrate/Competitorn/a
Meas. Tech.ChEMBL_1277577 (CHEMBL3096453)
IC50 4100±n/a nM
Citation Hanke, TDehm, FLiening, SPopella, SDMaczewsky, JPillong, MKunze, JWeinigel, CBarz, DKaiser, AWurglics, MLämmerhofer, MSchneider, GSautebin, LSchubert-Zsilavecz, MWerz, O Aminothiazole-featured pirinixic acid derivatives as dual 5-lipoxygenase and microsomal prostaglandin E2 synthase-1 inhibitors with improved potency and efficiency in vivo. J Med Chem56:9031-44 (2013) 
 
Polyunsaturated fatty acid 5-lipoxygenase
Name:Polyunsaturated fatty acid 5-lipoxygenase
Type:Enzyme
Mol. Mass.:77972.74
Organism:Homo sapiens (Human)
Description:Recombinant protein was purified from E. coli lysate. After ammonium sulfate precipitation and subsequent steps, the supernatant (S100) was used for 5-LO activity assay.
Residue:674
BDBM24560
NameBDBM24560
Synonyms:2-({4-chloro-6-[(2,3-dimethylphenyl)amino]pyrimidin-2-yl}sulfanyl)octanoic acid Pirinixic acid-based compound, 6a
TypeSmall organic molecule
Emp. Form.C20H26ClN3O2S
Mol. Mass.407.957
SMILESCCCCCCC(Sc1nc(Cl)cc(Nc2cccc(C)c2C)n1)C(O)=O