Reaction Details
TargetCoagulation factor X
LigandBDBM50443860
Substrate/Competitorn/a
Meas. Tech.ChEMBL_1277819 (CHEMBL3097585)
IC50 2.6±n/a nM
Citation Meneyrol, JFollmann, MLassalle, GWehner, VBarre, GRousseaux, TAltenburger, JMPetit, FBocskei, ZSchreuder, HAlet, NHerault, JPMillet, LDol, FFlorian, PSchaeffer, PSadoun, FKlieber, SBriot, CBono, FHerbert, JM 5-Chlorothiophene-2-carboxylic acid [(S)-2-[2-methyl-3-(2-oxopyrrolidin-1-yl)benzenesulfonylamino]-3-(4-methylpiperazin-1-yl)-3-oxopropyl]amide (SAR107375), a selective and potent orally active dual thrombin and factor Xa inhibitor. J Med Chem56:9441-56 (2014) 
 
Coagulation factor X
Name:Coagulation factor X
Type:Enzyme
Mol. Mass.:54726.60
Organism:Homo sapiens (Human)
Description:n/a
Residue:488
BDBM50443860
NameBDBM50443860
Synonyms:CHEMBL3091505
TypeSmall organic molecule
Emp. Form.C28H33ClN4O7S2
Mol. Mass.637.167
SMILESCCc1c(cccc1S(=O)(=O)N[C@@H](Cc1cc(on1)-c1ccc(Cl)s1)C(=O)N1CCC(CC1)OC)N1CCOCC1=O