Reaction Details
TargetP2X purinoceptor 3
LigandBDBM86478
Substrate/Competitorn/a
Meas. Tech.ChEMBL_1280010 (CHEMBL3096837)
IC50 97±n/a nM
Citation Cho, JHJung, KYJung, YKim, MHKo, HPark, CSKim, YC Design and synthesis of potent and selective P2X3 receptor antagonists derived from PPADS as potential pain modulators. Eur J Med Chem70:811-30 (2013) 
 
P2X purinoceptor 3
Name:P2X purinoceptor 3
Type:Protein
Mol. Mass.:44292.02
Organism:Homo sapiens (Human)
Description:P56373
Residue:397
BDBM86478
NameBDBM86478
Synonyms:A-317491
TypeSmall organic molecule
Emp. Form.C33H27NO8
Mol. Mass.565.5694
SMILESOC(=O)c1cc(C(O)=O)c(cc1C(O)=O)C(=O)N(Cc1cccc(Oc2ccccc2)c1)[C@H]1CCCc2ccccc12