Reaction Details
TargetP2X purinoceptor 1
LigandBDBM50444420
Substrate/Competitorn/a
Meas. Tech.ChEMBL_1280016 (CHEMBL3096843)
IC50 645±n/a nM
Citation Cho, JHJung, KYJung, YKim, MHKo, HPark, CSKim, YC Design and synthesis of potent and selective P2X3 receptor antagonists derived from PPADS as potential pain modulators. Eur J Med Chem70:811-30 (2013) 
 
P2X purinoceptor 1
Name:P2X purinoceptor 1
Type:PROTEIN
Mol. Mass.:44863.39
Organism:Mus musculus
Description:ChEMBL_1280016
Residue:399
BDBM50444420
NameBDBM50444420
Synonyms:CHEMBL3091605
TypeSmall organic molecule
Emp. Form.C16H15NO5
Mol. Mass.301.294
SMILESCc1nc(CCc2ccccc2)c(C(O)=O)c(C(O)=O)c1O