Reaction Details
TargetCyclin-dependent kinase 2
LigandBDBM50444934
Substrate/Competitorn/a
Meas. Tech.ChEMBL_1281339 (CHEMBL3101312)
Kd 48±n/a nM
Citation Deng, YShipps, GWZhao, LSiddiqui, MAPopovici-Muller, JCurran, PJDuca, JSHruza, AWFischmann, TOMadison, VSZhang, RMcNemar, CWMayhood, TWSyto, RAnnis, AKirschmeier, PLees, EMParry, DAWindsor, WT Modulating the interaction between CDK2 and cyclin A with a quinoline-based inhibitor. Bioorg Med Chem Lett24:199-203 (2013) 
 
Cyclin-dependent kinase 2
Name:Cyclin-dependent kinase 2
Type:Enzyme Subunit
Mol. Mass.:33938.17
Organism:Homo sapiens (Human)
Description:P24941
Residue:298
BDBM50444934
NameBDBM50444934
Synonyms:CHEMBL3099762
TypeSmall organic molecule
Emp. Form.C29H25ClN2O6
Mol. Mass.532.972
SMILESCOC(=O)[C@H](Cc1ccc(O)cc1)NC(=O)c1cc(C(O)=O)c2cc(CCc3ccc(Cl)cc3)ccc2n1