Reaction Details
TargetCyclin-dependent kinase 2
LigandBDBM50444928
Substrate/Competitorn/a
Meas. Tech.ChEMBL_1281330 (CHEMBL3101303)
Temperature298.15±n/a K
IC50>10000±n/a nM
Commentsextracted
Citation Deng, YShipps, GWZhao, LSiddiqui, MAPopovici-Muller, JCurran, PJDuca, JSHruza, AWFischmann, TOMadison, VSZhang, RMcNemar, CWMayhood, TWSyto, RAnnis, AKirschmeier, PLees, EMParry, DAWindsor, WT Modulating the interaction between CDK2 and cyclin A with a quinoline-based inhibitor. Bioorg Med Chem Lett24:199-203 (2013) 
 
Cyclin-dependent kinase 2
Name:Cyclin-dependent kinase 2
Type:Enzyme Subunit
Mol. Mass.:33938.17
Organism:Homo sapiens (Human)
Description:P24941
Residue:298
BDBM50444928
NameBDBM50444928
Synonyms:CHEMBL3099743
TypeSmall organic molecule
Emp. Form.C28H20F4N2O5
Mol. Mass.540.4624
SMILESCOC(=O)[C@H](Cc1ccc(F)cc1)NC(=O)c1cc(C(O)=O)c2cc(ccc2n1)-c1cccc(c1)C(F)(F)F