Reaction Details
TargetCyclin-dependent kinase 2
LigandBDBM50444937
Substrate/Competitorn/a
Meas. Tech.ChEMBL_1281339 (CHEMBL3101312)
Kd 12000±n/a nM
Citation Deng, YShipps, GWZhao, LSiddiqui, MAPopovici-Muller, JCurran, PJDuca, JSHruza, AWFischmann, TOMadison, VSZhang, RMcNemar, CWMayhood, TWSyto, RAnnis, AKirschmeier, PLees, EMParry, DAWindsor, WT Modulating the interaction between CDK2 and cyclin A with a quinoline-based inhibitor. Bioorg Med Chem Lett24:199-203 (2013) 
 
Cyclin-dependent kinase 2
Name:Cyclin-dependent kinase 2
Type:Enzyme Subunit
Mol. Mass.:33938.17
Organism:Homo sapiens (Human)
Description:P24941
Residue:298
BDBM50444937
NameBDBM50444937
Synonyms:CHEMBL3099759
TypeSmall organic molecule
Emp. Form.C27H22N2O6
Mol. Mass.470.4734
SMILESCOC(=O)[C@H](Cc1ccc(O)cc1)NC(=O)c1cc(C(O)=O)c2cc(ccc2n1)-c1ccccc1