Reaction Details
TargetAldehyde dehydrogenase 1A1
LigandBDBM50445562
Substrate/Competitorn/a
Meas. Tech.ChEMBL_1285211 (CHEMBL3107142)
IC50 607±n/a nM
Citation Duveau, DYYasgar, AWang, YHu, XKouznetsova, JBrimacombe, KRJadhav, ASimeonov, AThomas, CJMaloney, DJ Structure-activity relationship studies and biological characterization of human NAD(+)-dependent 15-hydroxyprostaglandin dehydrogenase inhibitors. Bioorg Med Chem Lett24:630-5 (2014) 
 
Aldehyde dehydrogenase 1A1
Name:Aldehyde dehydrogenase 1A1
Type:Protein
Mol. Mass.:54862.21
Organism:Homo sapiens (Human)
Description:n/a
Residue:501
BDBM50445562
NameBDBM50445562
Synonyms:CHEMBL3102994
TypeSmall organic molecule
Emp. Form.C19H20Cl2N4
Mol. Mass.375.295
SMILESCc1cc(c(C)n1-c1ccc(Cl)c(Cl)c1)-c1nnc2CCCCCn12