Reaction Details
Target15-hydroxyprostaglandin dehydrogenase [NAD(+)]
LigandBDBM50049243
Substrate/Competitorn/a
Meas. Tech.ChEMBL_1285204 (CHEMBL3107135)
IC50 2700±n/a nM
Citation Duveau, DYYasgar, AWang, YHu, XKouznetsova, JBrimacombe, KRJadhav, ASimeonov, AThomas, CJMaloney, DJ Structure-activity relationship studies and biological characterization of human NAD(+)-dependent 15-hydroxyprostaglandin dehydrogenase inhibitors. Bioorg Med Chem Lett24:630-5 (2014) 
 
15-hydroxyprostaglandin dehydrogenase [NAD(+)]
Name:15-hydroxyprostaglandin dehydrogenase [NAD(+)]
Type:Enzyme
Mol. Mass.:28974.46
Organism:Homo sapiens (Human)
Description:P15428
Residue:266
BDBM50049243
NameBDBM50049243
Synonyms:5-[4-(1-Methyl-cyclohexylmethoxy)-benzyl]-thiazolidine-2,4-dione 5-[4-(1-Methyl-cyclohexylmethoxy)-benzyl]-thiazolidine-2,4-dione(Ciglitazone) CIGLITAZONE | US8637558, 112
TypeSmall organic molecule
Emp. Form.C18H23NO3S
Mol. Mass.333.445
SMILESCC1(COc2ccc(Cc3sc(=O)[nH]c3O)cc2)CCCCC1