Reaction Details
Target11-beta-hydroxysteroid dehydrogenase 1
LigandBDBM50445574
Substrate/Competitorn/a
Meas. Tech.ChEMBL_1285730 (CHEMBL3107719)
IC50 2.3±n/a nM
Citation Ye, XYYoon, DChen, SYNayeem, AGolla, RSeethala, RWang, MHarper, TSleczka, BGApedo, ALi, YXHe, BKirby, MGordon, DARobl, JA Synthesis and structure-activity relationship of 2-adamantylmethyl tetrazoles as potent and selective inhibitors of human 11ß-hydroxysteroid dehydrogenase type 1 (11ß-HSD1). Bioorg Med Chem Lett24:654-60 (2014) 
 
11-beta-hydroxysteroid dehydrogenase 1
Name:11-beta-hydroxysteroid dehydrogenase 1
Type:Enzyme
Mol. Mass.:32409.16
Organism:Homo sapiens (Human)
Description:P28845
Residue:292
BDBM50445574
NameBDBM50445574
Synonyms:CHEMBL3103525
TypeSmall organic molecule
Emp. Form.C25H25F3N4O
Mol. Mass.454.4874
SMILESOC1C2CC3CC1CC(C2)C3(Cc1nnn[nH]1)c1ccc(cc1)-c1ccc(cc1)C(F)(F)F