Reaction Details
TargetCholinesterase
LigandBDBM50445701
Substrate/Competitorn/a
Meas. Tech.ChEMBL_1284373 (CHEMBL3105939)
IC50 10410±n/a nM
Citation Basiri, AMurugaiyah, VOsman, HKumar, RSKia, YHooda, AParsons, RB Cholinesterase inhibitory activity versus aromatic core multiplicity: a facile green synthesis and molecular docking study of novel piperidone embedded thiazolopyrimidines. Bioorg Med Chem22:906-16 (2014) 
 
Cholinesterase
Name:Cholinesterase
Type:Enzyme
Mol. Mass.:65643.35
Organism:Equus caballus (Horse)
Description:P81908
Residue:574
BDBM50445701
NameBDBM50445701
Synonyms:CHEMBL3104331
TypeSmall organic molecule
Emp. Form.C29H25N3OS
Mol. Mass.463.593
SMILESCOc1ccc(cc1)C1=CSC2=NC3=C(CNC\C3=C/c3ccccc3)C(N12)c1ccccc1