Reaction Details
TargetCholinesterase
LigandBDBM50445706
Substrate/Competitorn/a
Meas. Tech.ChEMBL_1284373 (CHEMBL3105939)
IC50 7650±n/a nM
Citation Basiri, AMurugaiyah, VOsman, HKumar, RSKia, YHooda, AParsons, RB Cholinesterase inhibitory activity versus aromatic core multiplicity: a facile green synthesis and molecular docking study of novel piperidone embedded thiazolopyrimidines. Bioorg Med Chem22:906-16 (2014) 
 
Cholinesterase
Name:Cholinesterase
Type:Enzyme
Mol. Mass.:65643.35
Organism:Equus caballus (Horse)
Description:P81908
Residue:574
BDBM50445706
NameBDBM50445706
Synonyms:CHEMBL3104326
TypeSmall organic molecule
Emp. Form.C28H20Cl3N3S
Mol. Mass.536.903
SMILESClc1ccc(cc1)C1=CSC2=NC3=C(CNC\C3=C/c3ccccc3Cl)C(N12)c1ccccc1Cl