Reaction Details
TargetCholinesterase
LigandBDBM50445721
Substrate/Competitorn/a
Meas. Tech.ChEMBL_1284373 (CHEMBL3105939)
IC50 6260±n/a nM
Citation Basiri, AMurugaiyah, VOsman, HKumar, RSKia, YHooda, AParsons, RB Cholinesterase inhibitory activity versus aromatic core multiplicity: a facile green synthesis and molecular docking study of novel piperidone embedded thiazolopyrimidines. Bioorg Med Chem22:906-16 (2014) 
 
Cholinesterase
Name:Cholinesterase
Type:Enzyme
Mol. Mass.:65643.35
Organism:Equus caballus (Horse)
Description:P81908
Residue:574
BDBM50445721
NameBDBM50445721
Synonyms:CHEMBL3104450
TypeSmall organic molecule
Emp. Form.C20H19Cl2N3S
Mol. Mass.404.356
SMILESClc1ccc(\C=C2/CNCC3C2NC(=S)NC3c2ccc(Cl)cc2)cc1