Reaction Details
TargetATP-dependent 6-phosphofructokinase
LigandBDBM50446113
Substrate/Competitorn/a
Meas. Tech.ChEMBL_1288121 (CHEMBL3110581)
IC50 680±n/a nM
Citation Brimacombe, KRWalsh, MJLiu, LVásquez-Valdivieso, MGMorgan, HPMcNae, IFothergill-Gilmore, LAMichels, PAAuld, DSSimeonov, AWalkinshaw, MDShen, MBoxer, MB Identification of ML251, a Potent Inhibitor of T. brucei and T. cruzi Phosphofructokinase. ACS Med Chem Lett5:12-7 (2014) 
 
ATP-dependent 6-phosphofructokinase
Name:ATP-dependent 6-phosphofructokinase
Type:PROTEIN
Mol. Mass.:53537.94
Organism:Trypanosoma brucei
Description:ChEMBL_1288121
Residue:487
BDBM50446113
NameBDBM50446113
Synonyms:CHEMBL3108846
TypeSmall organic molecule
Emp. Form.C19H15ClF3N3O4S
Mol. Mass.473.853
SMILESCc1cc(NS(=O)(=O)c2ccc(NC(=O)Cc3ccc(Cl)c(c3)C(F)(F)F)cc2)no1