Reaction Details
TargetPolyunsaturated fatty acid 5-lipoxygenase
LigandBDBM50446404
Substrate/Competitorn/a
Meas. Tech.ChEMBL_1287340 (CHEMBL3111170)
IC50>10000±n/a nM
Citation Filosa, RPeduto, AAparoy, PSchaible, AMLuderer, SKrauth, VPetronzi, CMassa, Ade Rosa, MReddanna, PWerz, O Discovery and biological evaluation of novel 1,4-benzoquinone and related resorcinol derivatives that inhibit 5-lipoxygenase. Eur J Med Chem67:269-79 (2013) 
 
Polyunsaturated fatty acid 5-lipoxygenase
Name:Polyunsaturated fatty acid 5-lipoxygenase
Type:Enzyme
Mol. Mass.:77972.74
Organism:Homo sapiens (Human)
Description:Recombinant protein was purified from E. coli lysate. After ammonium sulfate precipitation and subsequent steps, the supernatant (S100) was used for 5-LO activity assay.
Residue:674
BDBM50446404
NameBDBM50446404
Synonyms:CHEMBL3109720
TypeSmall organic molecule
Emp. Form.C12H9NO4
Mol. Mass.231.2042
SMILESOc1ccc(c(O)c1)-c1cccc(c1)[N+]([O-])=O