Reaction Details
TargetPolyunsaturated fatty acid lipoxygenase ALOX12
LigandBDBM50446402
Substrate/Competitorn/a
Meas. Tech.ChEMBL_1287333 (CHEMBL3111163)
IC50>10000±n/a nM
Citation Filosa, RPeduto, AAparoy, PSchaible, AMLuderer, SKrauth, VPetronzi, CMassa, Ade Rosa, MReddanna, PWerz, O Discovery and biological evaluation of novel 1,4-benzoquinone and related resorcinol derivatives that inhibit 5-lipoxygenase. Eur J Med Chem67:269-79 (2013) 
 
Polyunsaturated fatty acid lipoxygenase ALOX12
Name:Polyunsaturated fatty acid lipoxygenase ALOX12
Type:Protein
Mol. Mass.:75689.18
Organism:Homo sapiens (Human)
Description:P18054
Residue:663
BDBM50446402
NameBDBM50446402
Synonyms:CHEMBL3109726
TypeSmall organic molecule
Emp. Form.C18H14O3
Mol. Mass.278.302
SMILESOc1ccc(C(=O)Cc2ccc3ccccc3c2)c(O)c1